The tag has no wiki summary.

learn more… | top users | synonyms

1
vote
1answer
51 views

How do I remove the 'split lines' error in Bluefish?

How can I stop this error from occurring every time I start Bluefish editor? Of course, apart from shortening long lines... Bluefish 2.2.4, running on Fedora 19. Edit: I have done this in ...
2
votes
1answer
306 views

KVM to Ovirt VM migration

I installed ovirt on a machine that was already hosting KVM virtual machines. I am now trying to migrate those VMs over to RHEV format, but I am receiving SASL authentication errors using virt-v2v. I ...
2
votes
1answer
441 views

Unable to install SciPy

I need to use the module skimage, which calls the module SciPy (I need to find contours) import numpy from sys import argv from PIL import Image from skimage import measure # Inicialization ...
1
vote
1answer
63 views

`ls` behavior on EACCES error for /root and /root/some-rubbish

I'm trying to code a clone of the ls command as part of a school exercise. I'm wondering why the following output is displayed by ls: $> ls -- -test_dir /root /root/some-rubbish ls: ...
0
votes
1answer
247 views

Occasional error from bash on AIX: Interrupted system call

I am experiencing problems with process substitution in bash on AIX It happens very rarely, apparently only when the server is loaded. An example error message is: line 9: /tmp//sh-np-7841523: ...
0
votes
1answer
564 views

Error while Compiling Subversion with a custom-compiled Apache on a shared server

Am using a RHEL 5.5 shared server, my user has complete access to /opt folder. No root access, cant write to /etc, /usr etc. So, I downloaded httpd-2.4.6 and httpd-2.4.6-deps onto /opt (ie. ...
0
votes
1answer
138 views

playonlinux crashing on Fedora 19

I installed playonlinux using the default repository and when I run the command 'playonlinux' its getting crash and prints this output Traceback (most recent call last): File "mainwindow.py", line ...
2
votes
1answer
145 views

How to have a bash script perform a specific action on errors of _each_ command?

Similarly to set -e performs an exit on "uncaught" $? != 0, I'd like to have this event trigger the execution of another command, e.g. a logger call. How can this be done?
0
votes
1answer
156 views

How to make a GRUB Rescue Disc?

I am afraid that my GRUB is corrupted (I do a lot of experiments on my PC) and I know that I will not be able to reinstall Debian (downloading takes up a lot of time). Also, I am just 13 so I don't ...
2
votes
2answers
164 views

Testing which modules are unloaded with modprobe

I'm currently searching for the right driver for my Broadcom BCM4313 network/wifi device. At first no network was recognized at all, now I managed to connect, but the connection is really slow. I ...
1
vote
1answer
132 views

Unwanted messages every time I attempt to login?

I am using Linux Mint Olivia and it worked fine for past couple of months but from yesterday it keep showing these message whenever I want to login to my PC: Keys: Press S to skip mounting or M for ...
1
vote
3answers
5k views

sudo: no tty present and no askpass program specified

I have a perl script that I fork from another script that I launch from a web browser via mod_perl. The forked script (which ends up running as apache) needs to sudo service X stop as part of a ...
3
votes
2answers
443 views

Why does Bash history not record this command?

The command printf "#!/bin/bash\n" > t generates an error(bash: !/bin/bash\n": event not found), but hitting the up key does not recall the command so that I can modify it. Why is that? (What I ...
0
votes
0answers
47 views

Compiling Wine 1.7.1 in Gentoo

Trying to compile Wine 1.7.1 with the great new D3D and Opengl patches. I proceed like this: Download the GIT source code from here: ...
2
votes
2answers
72 views

Different error messages when using different strings in terminal

When I insert, for example, unix.stackexchange.com followed by Enter in terminal, I get the following error: unix.stackexchange.com: command not found This is ok and as I expected. But when I insert ...
2
votes
3answers
130 views

Syntax error in shell script

I have this script to divide a file over a 100000 or even more in 50000 lines. desc() { echo ...
1
vote
1answer
460 views

Error installing Fedora 19

I'm trying to install Fedora 19. After my computer booted from installation DVD for about 20 minutes, it displays white screen with 'Oh no! Something has gone wrong.' message. I've tried 3 times and ...
1
vote
1answer
2k views

“No such file or directory” on files that exist? [duplicate]

In the past day, I've found at least 4 binaries that say "bin-name: No such file or directory" when I try to run them. Even if I type part of the name and tab complete it, I get the same error. I'm on ...
0
votes
2answers
91 views

md5sum check fails for git-man-pages.tar.gz package

When I try to verify the integrity of git-man-pages package I downloaded from "http://code.google.com/p/git-core/downloads/detail?name=git-manpages-1.8.4.tar.gz&can=2&q=" it fails with error. ...
0
votes
1answer
2k views

E: Some index files failed to download. They have been ignored…” when tunning “sudo aptitude update”?

This is what the end of output after I run sudo apt-get update on Ubuntu 12.04: Ign http://apt.typesafe.com unicorn/main Translation-en 35% [Working]W: Failed to fetch ...
1
vote
1answer
1k views

Why do I get kicked out of a FTP session once I run a command?

Why do I get kicked out of a FTP session once I run a command? It seems that once I successfully login into a server is get the following after running a command such as "ls" (I've enclosed the error ...
4
votes
1answer
1k views

How can I build a rpm for i386 target on a x86-64 machine?

I am building an rpm using rpmbuild command as: rpmbuild -bb --root <DIRECTORY> --target i386 --define "_topdir <DIRECTORY>" <specfile>.spec When I use my SLED 10 SP3 x86 machine, ...
3
votes
1answer
121 views

How to troubleshoot systemd's “contradicts existing jobs” error message

Looking through my system logs, I see the following message in /var/log/messages: Sep 2 15:29:15 <myhostname> systemd[1]: Requested transaction contradicts existing jobs: File exists So, my ...
0
votes
0answers
150 views

What is “ /opt/google/chrome/nacl_helper_bootstrap ”mmap_zero“ access”

I am using Fedora 12 Linux (and, yes, it is soon to be updated), and got the message in the image. My question, please nicely, is what does it mean and what should I do about it? the full text of the ...
1
vote
1answer
360 views

Using archlinux on vmware error 8000

I have been playing around with Linux a bit and I wanted to try using Arch Linux so I downlaoded the .iso and I set up vmware player saying that it was another Linux 2.6x kernel. As soon as I launched ...
0
votes
2answers
776 views

Error 404 Munin page not Found

I installed Munin and munin-node on Server and httpd was already installed. But after installed when i run the munin-node the Browser gives me this error. Not Found The requested URL /munin was not ...
0
votes
1answer
888 views

ZoneMinder compiling error: “missing binary operator before token ”(“”

When installing ZoneMinder 1.25.0 in CentOS 6.4 (64-bit) the following error pops up when executing make: zm_ffmpeg_camera.cpp:105:44: error: missing binary operator before token "(" Full log: ...
1
vote
2answers
778 views

Errors while invoking Web service using `Curl` command from Unix terminal

I have been trying to invoke a web service from my script using the Curl command . I got the script from HERE. My Script : #! /bin/sh ...
0
votes
2answers
213 views

chkrootkit throws Signal 13 when searching through /var/tmp

On my debian squeeze server in the chkrootkit log I get loads of these errors: /usr/bin/find: Prozeß "head" wurde durch das Signal 13 abgebrochen. /usr/bin/find: Prozeß "head" wurde durch das Signal ...
0
votes
1answer
159 views

Upgrading debian squeeze to sid

Atm I am trying to upgrade my debian squeeze to sid. I followed this tutorial: www(.)digitalocean.com/community/articles/upgrading-debian-to-unstable Everything seems to work well until Step 3. While ...
1
vote
0answers
288 views

An Error Occured, Error attaching disk image: GDBus.Error:… when opening downloaded files in firefox, how to fix this? [closed]

Error attaching disk image: GDBus.Error:org.freedesktop.UDisks2.Error.Failed: Error setting up loop device /dev/loop0: Invalid argument (udisks-error-quark, 0) That one above is the error Im having ...
1
vote
1answer
440 views

-bash: /usr/sbin/useradd: Input/output error — What does this mean?

Today, on my Centos server I tried to add a user but got the following error: -bash: /usr/sbin/useradd: Input/output error How do I fix it?
1
vote
1answer
42 views

Command line error in OpenSUSE (old version)

I'm using an old version of OpenSUSE and when I try to update some package via the command line, e.g. Zypper update firefox it shows the message listed below. System management is locked by ...
4
votes
1answer
100 views

Stop a task based on output

I have a task that runs written in Mono, however sometimes (randomly) the Mono runtime will hang after the task is complete and just print: _wapi_handle_ref: Attempting to ref unused handle 0x2828 ...
0
votes
3answers
408 views

TERM variable in chroot

I've created a chroot with the help of jailkit and now I'm trying to install some other libraries and tools. First I tried to install clear library. I've copied the file from the /bin folder and ...
0
votes
1answer
409 views

rsync “Permission denied” despite ownership

I just rsync'd a bunch of files, from a Windows box running cygwin sshd, to a CentOS 6.4 box. I ran rsync -e sshd... on CentOS to do this. Then I plugged in a USB drive on the CentOS box, formatted ...
1
vote
1answer
2k views

Can't start Tomcat on Ubuntu

I installed Tomcat on Ubuntu. Then I created a new user. Then did: liferay@web-svr:~/liferay-portal-6.1.1-ce-ga2/tomcat-7.0.27/bin$ chmod +x *.sh Afterwards, I added JAVA_HOME and PATH in bash like ...
1
vote
1answer
929 views

virt-install complains “error: no such option: --network-bridge:br0”

I was following the directions here to set up a VM in CentOS 6.4 i386/686. But I'm getting this error: $ sudo virt-install --network-bridge:br0 --name vm1 --ram=1024 --vcpus=1 --disk ...
3
votes
1answer
88 views

How can I change the error messages for 'touch'?

Lets just have some typical usage of touch as expected: $ touch this $ sudo chown root this $ touch this touch: this: Permission denied Now what I want to do is change touch: this: Permission ...
1
vote
2answers
923 views

PHP exec command has the result 0 even if an error occurs

I have this PHP code: $execout=exec('ssh root@xxx.xxx.xxx.xx "sudo /etc/init.d/smokeping reload"',$output1,$result); if($result !=0){ echo"that can't reload"; } else{ echo "successfully ...
1
vote
1answer
111 views

debootstrap: unknown user 'root' in state override file

I muffed up my graphics card driver and/or xconfig files and decided to just reinstall Debian Linux (squeeze 6.0.6) last night. Part way through installing the base system, it failed. Sorry, I didn't ...
5
votes
1answer
697 views

How to trigger error using Trap command

I am using Ubuntu 12.04.2. I am trying to use "trap" command to capture abnormal or error in my shell script but I am also trying to manually trigger "Error" exit. I have tried exit 1, but it won't ...
0
votes
1answer
622 views

Nohup process not running into ssh

I have a question on the use of nohup in an ssh session. During more than three years my java software executed the following command daily using a remote ssh session: cd some_path; chmod 777 ...
0
votes
3answers
721 views

How to install Skype on Linux Mint

I downloaded the installer from the website. When I run it, I get the following error: Your system has broken dependencies. This application cannot continue until it is fixed. To fix it, run ...
0
votes
0answers
23 views

Traceback (most recent call last) error appears on terminal [duplicate]

Recently i encountered a weird problem in Linux mint 14.When i enter any command (e.g $ ls) in terminal it throws error saying Traceback (most recent call last). Detail Description of the error is ...
2
votes
1answer
477 views

broken pipe error with popen and JS ffi

I am using a ffi for nodejs which for the most part has nothing to do with this question which is really about understanding pipes better, but does offer some context function exec(cmd) { var ...
1
vote
1answer
294 views

Installed Fedora 18 on UEFI machine, got lvm.mod not found error

I've installed Fedora 18 on UEFI system, when I boot the computer I get this error message: File "/EFI/fedora/x86_64-efi/lvm.mod" not found no server specified What should I do?
1
vote
2answers
811 views

Getting error opening Windows. Error 1: Filename must be either an absolute pathname or blocklist

I've installed CentOS 6.4 on UEFI machine. Created /boot/efi partition and installed grub in it. But when I open Other in the grub menu I get this error: Error 1: Filename must be either an ...
0
votes
1answer
449 views

How to fix “org.freedesktop.PolicyKit1” error when unmounting USBs in Thunar?

I recently installed Debian Wheezy with XFce4. Whenever I try to unmount a USB, I get this error message: GDBus.Error:org.freedesktop.DBus.Error.ServiceUnknown: The name org.freedesktop.PolicyKit1 ...
3
votes
2answers
8k views

What does “INFO: task XXX blocked for more than 120 seconds” exactly mean on Linux?

I had this message in my kernel log : INFO: task XXX blocked for more than 120 seconds. I would like to know what it means technically: under what conditions does the kernel display this message about ...